首页 > 其他 > 详细

maven编译时出现There are test failures

时间:2020-01-14 22:53:19      阅读:82      评论:0      收藏:0      [点我收藏+]

[ERROR] Failed to execute goal org.apache.maven.plugins:maven-surefire-plugin:2.10:test (default-test) on project web_nanchang: There are test failures.

[ERROR]

[ERROR] Please refer to E:\maven\web_nanchang\target\surefire-reports for the individual test results.

解决方法:

这是因为测试代码时遇到错误,它会停止编译。只需要在pom.xml的<project>里添加以下配置,使得测试出错不影响项目的编译。

<build>
		<plugins>
			<plugin>
				<groupId>org.apache.maven.plugins</groupId>
				<artifactId>maven-surefire-plugin</artifactId>
				<configuration>
					<testFailureIgnore>true</testFailureIgnore>
				</configuration>
			</plugin>
		</plugins>
	</build>

maven编译时出现There are test failures

原文:https://www.cnblogs.com/yachao1120/p/12194349.html

(0)
(0)
   
举报
评论 一句话评论(0
关于我们 - 联系我们 - 留言反馈 - 联系我们:wmxa8@hotmail.com
© 2014 bubuko.com 版权所有
打开技术之扣,分享程序人生!